Problemas con Etiquetas y busquedas en ALFRESCO 4.0.c

cancel
Showing results for 
Search instead for 
Did you mean: 
Highlighted
Member II

Problemas con Etiquetas y busquedas en ALFRESCO 4.0.c

Estimados,

He hecho la instalación de alfreco y funcionaba sin ningún problema. Hasta ahí todo bien. Pero despues de unos días comenzo a arrojar el siguiente error.

En la sección ETIQUETAS —> No se pudieron recuperar las etiquetas

Y revisando la información, encontre lo siguiente:

08050027 Wrapped Exception (with status template): 080514461 Failed to execute script 'classpath*:alfresco/templates/webscripts/org/alfresco/repository/tagging/tags.get.js': 080514460

Lo mismo aparece cuando ingreso a Administración de Categorías —>
JavaException: org.alfresco.repo.search.impl.lucene.LuceneQueryParserException: 080514463

Estube buscando en los foros, pero no encontre información y en Google nada relacionado.

Adicionalmente en el tema de las busquedas, antes funcionaba sin ningún problema y ahora no aparece nada, ni siquiera con los mismo documentos que vienen por defecto en la aplicación. Entrando como administrador, solo puedo rescatar el siguente error.

org.alfresco.repo.search.impl.lucene.LuceneQueryParserException


Saludos Cordiales, les informo que oy nuevo en el tema

Gracias por el apoyo
11 Replies
Highlighted
Intermediate

Re: Problemas con Etiquetas y busquedas en ALFRESCO 4.0.c

Buenas alrivera.

Necesitamos ver el fragmento del log correspondiente al error para ver por donde van los tiros, podrías pegárnoslo? (el de alfresco.log)

Un saludo.
Highlighted
Member II

Re: Problemas con Etiquetas y busquedas en ALFRESCO 4.0.c

Creo que no esta generando el archivo log,

Hay algun paso para verificar esto.



Saludos
Highlighted
Intermediate

Re: Problemas con Etiquetas y busquedas en ALFRESCO 4.0.c

Dime en qué sistema operativo está instalado y te comento donde está ubicado ;-)
Highlighted
Member II

Re: Problemas con Etiquetas y busquedas en ALFRESCO 4.0.c

Estimada,


Esta instalado en Windows Server 2008
Highlighted
Intermediate

Re: Problemas con Etiquetas y busquedas en ALFRESCO 4.0.c

Busca el alfresco.log dentro de system32/

Comentame si está ahí  :wink:
Member II

Re: Problemas con Etiquetas y busquedas en ALFRESCO 4.0.c

Estimada,


Espero que esto pueda servir. Gracias ya atento a comentarios


02:00:00,026 ERROR [org.quartz.core.JobRunShell] Job DEFAULT.search.alfrescoCoreBackupJobDetail threw an unhandled Exception:
org.alfresco.error.AlfrescoRuntimeException: 081027226 Bakup for core alfresco feailed ….
   at org.alfresco.repo.search.impl.solr.SolrBackupClient.executeImpl(SolrBackupClient.java:147)
   at org.alfresco.repo.search.impl.solr.SolrBackupClient.execute(SolrBackupClient.java:102)
   at org.alfresco.repo.search.impl.solr.SolrBackupJob.execute(SolrBackupJob.java:58)
   at org.quartz.core.JobRunShell.run(JobRunShell.java:216)
   at org.quartz.simpl.SimpleThreadPool$WorkerThread.run(SimpleThreadPool.java:563)
Caused by: org.apache.solr.client.solrj.SolrServerException: javax.net.ssl.SSLHandshakeException: sun.security.validator.ValidatorException: PKIX path validation failed: java.security.cert.CertPathValidatorException: timestamp check failed
   at org.apache.solr.client.solrj.impl.CommonsHttpSolrServer.request(CommonsHttpSolrServer.java:483)
   at org.apache.solr.client.solrj.impl.CommonsHttpSolrServer.request(CommonsHttpSolrServer.java:244)
   at org.apache.solr.client.solrj.request.QueryRequest.process(QueryRequest.java:89)
   at org.apache.solr.client.solrj.SolrServer.query(SolrServer.java:118)
   at org.alfresco.repo.solr.SOLRAdminClient.query(SOLRAdminClient.java:184)
   at org.alfresco.repo.search.impl.solr.SolrBackupClient.executeImpl(SolrBackupClient.java:136)
   … 4 more
Caused by: javax.net.ssl.SSLHandshakeException: sun.security.validator.ValidatorException: PKIX path validation failed: java.security.cert.CertPathValidatorException: timestamp check failed
   at com.sun.net.ssl.internal.ssl.Alerts.getSSLException(Alerts.java:174)
   at com.sun.net.ssl.internal.ssl.SSLSocketImpl.fatal(SSLSocketImpl.java:1649)
   at com.sun.net.ssl.internal.ssl.Handshaker.fatalSE(Handshaker.java:241)
   at com.sun.net.ssl.internal.ssl.Handshaker.fatalSE(Handshaker.java:235)
   at com.sun.net.ssl.internal.ssl.ClientHandshaker.serverCertificate(ClientHandshaker.java:1206)
   at com.sun.net.ssl.internal.ssl.ClientHandshaker.processMessage(ClientHandshaker.java:136)
   at com.sun.net.ssl.internal.ssl.Handshaker.processLoop(Handshaker.java:593)
   at com.sun.net.ssl.internal.ssl.Handshaker.process_record(Handshaker.java:529)
   at com.sun.net.ssl.internal.ssl.SSLSocketImpl.readRecord(SSLSocketImpl.java:893)
   at com.sun.net.ssl.internal.ssl.SSLSocketImpl.performInitialHandshake(SSLSocketImpl.java:1138)
   at com.sun.net.ssl.internal.ssl.SSLSocketImpl.writeRecord(SSLSocketImpl.java:632)
   at com.sun.net.ssl.internal.ssl.AppOutputStream.write(AppOutputStream.java:59)
   at java.io.BufferedOutputStream.flushBuffer(BufferedOutputStream.java:65)
   at java.io.BufferedOutputStream.flush(BufferedOutputStream.java:123)
   at org.apache.commons.httpclient.HttpConnection.flushRequestOutputStream(HttpConnection.java:828)
   at org.apache.commons.httpclient.MultiThreadedHttpConnectionManager$HttpConnectionAdapter.flushRequestOutputStream(MultiThreadedHttpConnectionManager.java:1565)
   at org.apache.commons.httpclient.HttpMethodBase.writeRequest(HttpMethodBase.java:2116)
   at org.apache.commons.httpclient.HttpMethodBase.execute(HttpMethodBase.java:1096)
   at org.apache.commons.httpclient.HttpMethodDirector.executeWithRetry(HttpMethodDirector.java:398)
   at org.apache.commons.httpclient.HttpMethodDirector.executeMethod(HttpMethodDirector.java:171)
   at org.apache.commons.httpclient.HttpClient.executeMethod(HttpClient.java:397)
   at org.apache.commons.httpclient.HttpClient.executeMethod(HttpClient.java:323)
   at org.apache.solr.client.solrj.impl.CommonsHttpSolrServer.request(CommonsHttpSolrServer.java:427)
   … 9 more
Caused by: sun.security.validator.ValidatorException: PKIX path validation failed: java.security.cert.CertPathValidatorException: timestamp check failed
   at sun.security.validator.PKIXValidator.doValidate(PKIXValidator.java:289)
   at sun.security.validator.PKIXValidator.doValidate(PKIXValidator.java:263)
   at sun.security.validator.PKIXValidator.engineValidate(PKIXValidator.java:173)
   at sun.security.validator.Validator.validate(Validator.java:218)
   at com.sun.net.ssl.internal.ssl.X509TrustManagerImpl.validate(X509TrustManagerImpl.java:126)
   at com.sun.net.ssl.internal.ssl.X509TrustManagerImpl.checkServerTrusted(X509TrustManagerImpl.java:209)
   at com.sun.net.ssl.internal.ssl.X509TrustManagerImpl.checkServerTrusted(X509TrustManagerImpl.java:249)
   at com.sun.net.ssl.internal.ssl.ClientHandshaker.serverCertificate(ClientHandshaker.java:1185)
   … 27 more
Caused by: java.security.cert.CertPathValidatorException: timestamp check failed
   at sun.security.provider.certpath.PKIXMasterCertPathValidator.validate(PKIXMasterCertPathValidator.java:139)
   at sun.security.provider.certpath.PKIXCertPathValidator.doValidate(PKIXCertPathValidator.java:328)
   at sun.security.provider.certpath.PKIXCertPathValidator.engineValidate(PKIXCertPathValidator.java:178)
   at java.security.cert.CertPathValidator.validate(CertPathValidator.java:250)
   at sun.security.validator.PKIXValidator.doValidate(PKIXValidator.java:275)
   … 34 more
Caused by: java.security.cert.CertificateExpiredException: NotAfter: Fri Aug 17 08:04:11 CLT 2012
   at sun.security.x509.CertificateValidity.valid(CertificateValidity.java:256)
   at sun.security.x509.X509CertImpl.checkValidity(X509CertImpl.java:570)
   at sun.security.provider.certpath.BasicChecker.verifyTimestamp(BasicChecker.java:157)
   at sun.security.provider.certpath.BasicChecker.check(BasicChecker.java:109)
   at sun.security.provider.certpath.PKIXMasterCertPathValidator.validate(PKIXMasterCertPathValidator.java:117)
   … 38 more
02:00:00,026 ERROR [org.quartz.core.ErrorLogger] Job (DEFAULT.search.alfrescoCoreBackupJobDetail threw an exception.
org.quartz.SchedulerException: Job threw an unhandled exception. [See nested exception: org.alfresco.error.AlfrescoRuntimeException: 081027226 Bakup for core alfresco feailed …. ]
   at org.quartz.core.JobRunShell.run(JobRunShell.java:227)
   at org.quartz.simpl.SimpleThreadPool$WorkerThread.run(SimpleThreadPool.java:563)
Caused by: org.alfresco.error.AlfrescoRuntimeException: 081027226 Bakup for core alfresco feailed ….
   at org.alfresco.repo.search.impl.solr.SolrBackupClient.executeImpl(SolrBackupClient.java:147)
   at org.alfresco.repo.search.impl.solr.SolrBackupClient.execute(SolrBackupClient.java:102)
   at org.alfresco.repo.search.impl.solr.SolrBackupJob.execute(SolrBackupJob.java:58)
   at org.quartz.core.JobRunShell.run(JobRunShell.java:216)
   … 1 more
Caused by: org.apache.solr.client.solrj.SolrServerException: javax.net.ssl.SSLHandshakeException: sun.security.validator.ValidatorException: PKIX path validation failed: java.security.cert.CertPathValidatorException: timestamp check failed
   at org.apache.solr.client.solrj.impl.CommonsHttpSolrServer.request(CommonsHttpSolrServer.java:483)
   at org.apache.solr.client.solrj.impl.CommonsHttpSolrServer.request(CommonsHttpSolrServer.java:244)
   at org.apache.solr.client.solrj.request.QueryRequest.process(QueryRequest.java:89)
   at org.apache.solr.client.solrj.SolrServer.query(SolrServer.java:118)
   at org.alfresco.repo.solr.SOLRAdminClient.query(SOLRAdminClient.java:184)
   at org.alfresco.repo.search.impl.solr.SolrBackupClient.executeImpl(SolrBackupClient.java:136)
   … 4 more
Caused by: javax.net.ssl.SSLHandshakeException: sun.security.validator.ValidatorException: PKIX path validation failed: java.security.cert.CertPathValidatorException: timestamp check failed
   at com.sun.net.ssl.internal.ssl.Alerts.getSSLException(Alerts.java:174)
   at com.sun.net.ssl.internal.ssl.SSLSocketImpl.fatal(SSLSocketImpl.java:1649)
   at com.sun.net.ssl.internal.ssl.Handshaker.fatalSE(Handshaker.java:241)
   at com.sun.net.ssl.internal.ssl.Handshaker.fatalSE(Handshaker.java:235)
   at com.sun.net.ssl.internal.ssl.ClientHandshaker.serverCertificate(ClientHandshaker.java:1206)
   at com.sun.net.ssl.internal.ssl.ClientHandshaker.processMessage(ClientHandshaker.java:136)
   at com.sun.net.ssl.internal.ssl.Handshaker.processLoop(Handshaker.java:593)
   at com.sun.net.ssl.internal.ssl.Handshaker.process_record(Handshaker.java:529)
   at com.sun.net.ssl.internal.ssl.SSLSocketImpl.readRecord(SSLSocketImpl.java:893)
   at com.sun.net.ssl.internal.ssl.SSLSocketImpl.performInitialHandshake(SSLSocketImpl.java:1138)
   at com.sun.net.ssl.internal.ssl.SSLSocketImpl.writeRecord(SSLSocketImpl.java:632)
   at com.sun.net.ssl.internal.ssl.AppOutputStream.write(AppOutputStream.java:59)
   at java.io.BufferedOutputStream.flushBuffer(BufferedOutputStream.java:65)
   at java.io.BufferedOutputStream.flush(BufferedOutputStream.java:123)
   at org.apache.commons.httpclient.HttpConnection.flushRequestOutputStream(HttpConnection.java:828)
   at org.apache.commons.httpclient.MultiThreadedHttpConnectionManager$HttpConnectionAdapter.flushRequestOutputStream(MultiThreadedHttpConnectionManager.java:1565)
   at org.apache.commons.httpclient.HttpMethodBase.writeRequest(HttpMethodBase.java:2116)
   at org.apache.commons.httpclient.HttpMethodBase.execute(HttpMethodBase.java:1096)
   at org.apache.commons.httpclient.HttpMethodDirector.executeWithRetry(HttpMethodDirector.java:398)
   at org.apache.commons.httpclient.HttpMethodDirector.executeMethod(HttpMethodDirector.java:171)
   at org.apache.commons.httpclient.HttpClient.executeMethod(HttpClient.java:397)
   at org.apache.commons.httpclient.HttpClient.executeMethod(HttpClient.java:323)
   at org.apache.solr.client.solrj.impl.CommonsHttpSolrServer.request(CommonsHttpSolrServer.java:427)
   … 9 more
Caused by: sun.security.validator.ValidatorException: PKIX path validation failed: java.security.cert.CertPathValidatorException: timestamp check failed
   at sun.security.validator.PKIXValidator.doValidate(PKIXValidator.java:289)
   at sun.security.validator.PKIXValidator.doValidate(PKIXValidator.java:263)
   at sun.security.validator.PKIXValidator.engineValidate(PKIXValidator.java:173)
   at sun.security.validator.Validator.validate(Validator.java:218)
   at com.sun.net.ssl.internal.ssl.X509TrustManagerImpl.validate(X509TrustManagerImpl.java:126)
   at com.sun.net.ssl.internal.ssl.X509TrustManagerImpl.checkServerTrusted(X509TrustManagerImpl.java:209)
   at com.sun.net.ssl.internal.ssl.X509TrustManagerImpl.checkServerTrusted(X509TrustManagerImpl.java:249)
   at com.sun.net.ssl.internal.ssl.ClientHandshaker.serverCertificate(ClientHandshaker.java:1185)
   … 27 more
Caused by: java.security.cert.CertPathValidatorException: timestamp check failed
   at sun.security.provider.certpath.PKIXMasterCertPathValidator.validate(PKIXMasterCertPathValidator.java:139)
   at sun.security.provider.certpath.PKIXCertPathValidator.doValidate(PKIXCertPathValidator.java:328)
   at sun.security.provider.certpath.PKIXCertPathValidator.engineValidate(PKIXCertPathValidator.java:178)
   at java.security.cert.CertPathValidator.validate(CertPathValidator.java:250)
   at sun.security.validator.PKIXValidator.doValidate(PKIXValidator.java:275)
   … 34 more
Caused by: java.security.cert.CertificateExpiredException: NotAfter: Fri Aug 17 08:04:11 CLT 2012
   at sun.security.x509.CertificateValidity.valid(CertificateValidity.java:256)
   at sun.security.x509.X509CertImpl.checkValidity(X509CertImpl.java:570)
   at sun.security.provider.certpath.BasicChecker.verifyTimestamp(BasicChecker.java:157)
   at sun.security.provider.certpath.BasicChecker.check(BasicChecker.java:109)
   at sun.security.provider.certpath.PKIXMasterCertPathValidator.validate(PKIXMasterCertPathValidator.java:117)
   … 38 more
04:00:00,042 ERROR [org.quartz.core.JobRunShell] Job DEFAULT.search.archiveCoreBackupJobDetail threw an unhandled Exception:
org.alfresco.error.AlfrescoRuntimeException: 081027468 Bakup for core archive feailed ….
   at org.alfresco.repo.search.impl.solr.SolrBackupClient.executeImpl(SolrBackupClient.java:147)
   at org.alfresco.repo.search.impl.solr.SolrBackupClient.execute(SolrBackupClient.java:102)
   at org.alfresco.repo.search.impl.solr.SolrBackupJob.execute(SolrBackupJob.java:58)
   at org.quartz.core.JobRunShell.run(JobRunShell.java:216)
   at org.quartz.simpl.SimpleThreadPool$WorkerThread.run(SimpleThreadPool.java:563)
Caused by: org.apache.solr.client.solrj.SolrServerException: javax.net.ssl.SSLHandshakeException: sun.security.validator.ValidatorException: PKIX path validation failed: java.security.cert.CertPathValidatorException: timestamp check failed
   at org.apache.solr.client.solrj.impl.CommonsHttpSolrServer.request(CommonsHttpSolrServer.java:483)
   at org.apache.solr.client.solrj.impl.CommonsHttpSolrServer.request(CommonsHttpSolrServer.java:244)
   at org.apache.solr.client.solrj.request.QueryRequest.process(QueryRequest.java:89)
   at org.apache.solr.client.solrj.SolrServer.query(SolrServer.java:118)
   at org.alfresco.repo.solr.SOLRAdminClient.query(SOLRAdminClient.java:184)
   at org.alfresco.repo.search.impl.solr.SolrBackupClient.executeImpl(SolrBackupClient.java:136)
   … 4 more
Caused by: javax.net.ssl.SSLHandshakeException: sun.security.validator.ValidatorException: PKIX path validation failed: java.security.cert.CertPathValidatorException: timestamp check failed
   at com.sun.net.ssl.internal.ssl.Alerts.getSSLException(Alerts.java:174)
   at com.sun.net.ssl.internal.ssl.SSLSocketImpl.fatal(SSLSocketImpl.java:1649)
   at com.sun.net.ssl.internal.ssl.Handshaker.fatalSE(Handshaker.java:241)
   at com.sun.net.ssl.internal.ssl.Handshaker.fatalSE(Handshaker.java:235)
   at com.sun.net.ssl.internal.ssl.ClientHandshaker.serverCertificate(ClientHandshaker.java:1206)
   at com.sun.net.ssl.internal.ssl.ClientHandshaker.processMessage(ClientHandshaker.java:136)
   at com.sun.net.ssl.internal.ssl.Handshaker.processLoop(Handshaker.java:593)
   at com.sun.net.ssl.internal.ssl.Handshaker.process_record(Handshaker.java:529)
   at com.sun.net.ssl.internal.ssl.SSLSocketImpl.readRecord(SSLSocketImpl.java:893)
   at com.sun.net.ssl.internal.ssl.SSLSocketImpl.performInitialHandshake(SSLSocketImpl.java:1138)
   at com.sun.net.ssl.internal.ssl.SSLSocketImpl.writeRecord(SSLSocketImpl.java:632)
   at com.sun.net.ssl.internal.ssl.AppOutputStream.write(AppOutputStream.java:59)
   at java.io.BufferedOutputStream.flushBuffer(BufferedOutputStream.java:65)
   at java.io.BufferedOutputStream.flush(BufferedOutputStream.java:123)
   at org.apache.commons.httpclient.HttpConnection.flushRequestOutputStream(HttpConnection.java:828)
   at org.apache.commons.httpclient.MultiThreadedHttpConnectionManager$HttpConnectionAdapter.flushRequestOutputStream(MultiThreadedHttpConnectionManager.java:1565)
   at org.apache.commons.httpclient.HttpMethodBase.writeRequest(HttpMethodBase.java:2116)
   at org.apache.commons.httpclient.HttpMethodBase.execute(HttpMethodBase.java:1096)
   at org.apache.commons.httpclient.HttpMethodDirector.executeWithRetry(HttpMethodDirector.java:398)
   at org.apache.commons.httpclient.HttpMethodDirector.executeMethod(HttpMethodDirector.java:171)
   at org.apache.commons.httpclient.HttpClient.executeMethod(HttpClient.java:397)
   at org.apache.commons.httpclient.HttpClient.executeMethod(HttpClient.java:323)
   at org.apache.solr.client.solrj.impl.CommonsHttpSolrServer.request(CommonsHttpSolrServer.java:427)
   … 9 more
Caused by: sun.security.validator.ValidatorException: PKIX path validation failed: java.security.cert.CertPathValidatorException: timestamp check failed
   at sun.security.validator.PKIXValidator.doValidate(PKIXValidator.java:289)
   at sun.security.validator.PKIXValidator.doValidate(PKIXValidator.java:263)
   at sun.security.validator.PKIXValidator.engineValidate(PKIXValidator.java:173)
   at sun.security.validator.Validator.validate(Validator.java:218)
   at com.sun.net.ssl.internal.ssl.X509TrustManagerImpl.validate(X509TrustManagerImpl.java:126)
   at com.sun.net.ssl.internal.ssl.X509TrustManagerImpl.checkServerTrusted(X509TrustManagerImpl.java:209)
   at com.sun.net.ssl.internal.ssl.X509TrustManagerImpl.checkServerTrusted(X509TrustManagerImpl.java:249)
   at com.sun.net.ssl.internal.ssl.ClientHandshaker.serverCertificate(ClientHandshaker.java:1185)
   … 27 more
Caused by: java.security.cert.CertPathValidatorException: timestamp check failed
   at sun.security.provider.certpath.PKIXMasterCertPathValidator.validate(PKIXMasterCertPathValidator.java:139)
   at sun.security.provider.certpath.PKIXCertPathValidator.doValidate(PKIXCertPathValidator.java:328)
   at sun.security.provider.certpath.PKIXCertPathValidator.engineValidate(PKIXCertPathValidator.java:178)
   at java.security.cert.CertPathValidator.validate(CertPathValidator.java:250)
   at sun.security.validator.PKIXValidator.doValidate(PKIXValidator.java:275)
   … 34 more
Caused by: java.security.cert.CertificateExpiredException: NotAfter: Fri Aug 17 08:04:11 CLT 2012
   at sun.security.x509.CertificateValidity.valid(CertificateValidity.java:256)
   at sun.security.x509.X509CertImpl.checkValidity(X509CertImpl.java:570)
   at sun.security.provider.certpath.BasicChecker.verifyTimestamp(BasicChecker.java:157)
   at sun.security.provider.certpath.BasicChecker.check(BasicChecker.java:109)
   at sun.security.provider.certpath.PKIXMasterCertPathValidator.validate(PKIXMasterCertPathValidator.java:117)
   … 38 more
04:00:00,042 ERROR [org.quartz.core.ErrorLogger] Job (DEFAULT.search.archiveCoreBackupJobDetail threw an exception.
org.quartz.SchedulerException: Job threw an unhandled exception. [See nested exception: org.alfresco.error.AlfrescoRuntimeException: 081027468 Bakup for core archive feailed …. ]
   at org.quartz.core.JobRunShell.run(JobRunShell.java:227)
   at org.quartz.simpl.SimpleThreadPool$WorkerThread.run(SimpleThreadPool.java:563)
Caused by: org.alfresco.error.AlfrescoRuntimeException: 081027468 Bakup for core archive feailed ….
   at org.alfresco.repo.search.impl.solr.SolrBackupClient.executeImpl(SolrBackupClient.java:147)
   at org.alfresco.repo.search.impl.solr.SolrBackupClient.execute(SolrBackupClient.java:102)
   at org.alfresco.repo.search.impl.solr.SolrBackupJob.execute(SolrBackupJob.java:58)
   at org.quartz.core.JobRunShell.run(JobRunShell.java:216)
   … 1 more
Caused by: org.apache.solr.client.solrj.SolrServerException: javax.net.ssl.SSLHandshakeException: sun.security.validator.ValidatorException: PKIX path validation failed: java.security.cert.CertPathValidatorException: timestamp check failed
   at org.apache.solr.client.solrj.impl.CommonsHttpSolrServer.request(CommonsHttpSolrServer.java:483)
   at org.apache.solr.client.solrj.impl.CommonsHttpSolrServer.request(CommonsHttpSolrServer.java:244)
   at org.apache.solr.client.solrj.request.QueryRequest.process(QueryRequest.java:89)
   at org.apache.solr.client.solrj.SolrServer.query(SolrServer.java:118)
   at org.alfresco.repo.solr.SOLRAdminClient.query(SOLRAdminClient.java:184)
   at org.alfresco.repo.search.impl.solr.SolrBackupClient.executeImpl(SolrBackupClient.java:136)
   … 4 more
Caused by: javax.net.ssl.SSLHandshakeException: sun.security.validator.ValidatorException: PKIX path validation failed: java.security.cert.CertPathValidatorException: timestamp check failed
   at com.sun.net.ssl.internal.ssl.Alerts.getSSLException(Alerts.java:174)
   at com.sun.net.ssl.internal.ssl.SSLSocketImpl.fatal(SSLSocketImpl.java:1649)
   at com.sun.net.ssl.internal.ssl.Handshaker.fatalSE(Handshaker.java:241)
   at com.sun.net.ssl.internal.ssl.Handshaker.fatalSE(Handshaker.java:235)
   at com.sun.net.ssl.internal.ssl.ClientHandshaker.serverCertificate(ClientHandshaker.java:1206)
   at com.sun.net.ssl.internal.ssl.ClientHandshaker.processMessage(ClientHandshaker.java:136)
   at com.sun.net.ssl.internal.ssl.Handshaker.processLoop(Handshaker.java:593)
   at com.sun.net.ssl.internal.ssl.Handshaker.process_record(Handshaker.java:529)
   at com.sun.net.ssl.internal.ssl.SSLSocketImpl.readRecord(SSLSocketImpl.java:893)
   at com.sun.net.ssl.internal.ssl.SSLSocketImpl.performInitialHandshake(SSLSocketImpl.java:1138)
   at com.sun.net.ssl.internal.ssl.SSLSocketImpl.writeRecord(SSLSocketImpl.java:632)
   at com.sun.net.ssl.internal.ssl.AppOutputStream.write(AppOutputStream.java:59)
   at java.io.BufferedOutputStream.flushBuffer(BufferedOutputStream.java:65)
   at java.io.BufferedOutputStream.flush(BufferedOutputStream.java:123)
   at org.apache.commons.httpclient.HttpConnection.flushRequestOutputStream(HttpConnection.java:828)
   at org.apache.commons.httpclient.MultiThreadedHttpConnectionManager$HttpConnectionAdapter.flushRequestOutputStream(MultiThreadedHttpConnectionManager.java:1565)
   at org.apache.commons.httpclient.HttpMethodBase.writeRequest(HttpMethodBase.java:2116)
   at org.apache.commons.httpclient.HttpMethodBase.execute(HttpMethodBase.java:1096)
   at org.apache.commons.httpclient.HttpMethodDirector.executeWithRetry(HttpMethodDirector.java:398)
   at org.apache.commons.httpclient.HttpMethodDirector.executeMethod(HttpMethodDirector.java:171)
   at org.apache.commons.httpclient.HttpClient.executeMethod(HttpClient.java:397)
   at org.apache.commons.httpclient.HttpClient.executeMethod(HttpClient.java:323)
   at org.apache.solr.client.solrj.impl.CommonsHttpSolrServer.request(CommonsHttpSolrServer.java:427)
   … 9 more
Caused by: sun.security.validator.ValidatorException: PKIX path validation failed: java.security.cert.CertPathValidatorException: timestamp check failed
   at sun.security.validator.PKIXValidator.doValidate(PKIXValidator.java:289)
   at sun.security.validator.PKIXValidator.doValidate(PKIXValidator.java:263)
   at sun.security.validator.PKIXValidator.engineValidate(PKIXValidator.java:173)
   at sun.security.validator.Validator.validate(Validator.java:218)
   at com.sun.net.ssl.internal.ssl.X509TrustManagerImpl.validate(X509TrustManagerImpl.java:126)
   at com.sun.net.ssl.internal.ssl.X509TrustManagerImpl.checkServerTrusted(X509TrustManagerImpl.java:209)
   at com.sun.net.ssl.internal.ssl.X509TrustManagerImpl.checkServerTrusted(X509TrustManagerImpl.java:249)
   at com.sun.net.ssl.internal.ssl.ClientHandshaker.serverCertificate(ClientHandshaker.java:1185)
   … 27 more
Caused by: java.security.cert.CertPathValidatorException: timestamp check failed
   at sun.security.provider.certpath.PKIXMasterCertPathValidator.validate(PKIXMasterCertPathValidator.java:139)
   at sun.security.provider.certpath.PKIXCertPathValidator.doValidate(PKIXCertPathValidator.java:328)
   at sun.security.provider.certpath.PKIXCertPathValidator.engineValidate(PKIXCertPathValidator.java:178)
   at java.security.cert.CertPathValidator.validate(CertPathValidator.java:250)
   at sun.security.validator.PKIXValidator.doValidate(PKIXValidator.java:275)
   … 34 more
Caused by: java.security.cert.CertificateExpiredException: NotAfter: Fri Aug 17 08:04:11 CLT 2012
   at sun.security.x509.CertificateValidity.valid(CertificateValidity.java:256)
   at sun.security.x509.X509CertImpl.checkValidity(X509CertImpl.java:570)
   at sun.security.provider.certpath.BasicChecker.verifyTimestamp(BasicChecker.java:157)
   at sun.security.provider.certpath.BasicChecker.check(BasicChecker.java:109)
   at sun.security.provider.certpath.PKIXMasterCertPathValidator.validate(PKIXMasterCertPathValidator.java:117)
   … 38 more
16:13:38,464 ERROR [org.springframework.extensions.webscripts.AbstractRuntime] Exception from executeScript - redirecting to status template error: 08100029 Wrapped Exception (with status template): 081028940 Failed to execute script 'classpath*:alfresco/templates/webscripts/org/alfresco/collaboration/tagQuery.get.js': 081028939 Failed to execute search: PATH:"/app:company_home//*" AND ASPECT:"{http://www.alfresco.org/model/content/1.0}taggable"
org.springframework.extensions.webscripts.WebScriptException: 08100029 Wrapped Exception (with status template): 081028940 Failed to execute script 'classpath*:alfresco/templates/webscripts/org/alfresco/collaboration/tagQuery.get.js': 081028939 Failed to execute search: PATH:"/app:company_home//*" AND ASPECT:"{http://www.alfresco.org/model/content/1.0}taggable"
   at org.springframework.extensions.webscripts.AbstractWebScript.createStatusException(AbstractWebScript.java:971)
   at org.springframework.extensions.webscripts.DeclarativeWebScript.execute(DeclarativeWebScript.java:171)
   at org.alfresco.repo.web.scripts.RepositoryContainer$2.execute(RepositoryContainer.java:400)
   at org.alfresco.repo.transaction.RetryingTransactionHelper.doInTransaction(RetryingTransactionHelper.java:388)
   at org.alfresco.repo.web.scripts.RepositoryContainer.transactionedExecute(RepositoryContainer.java:462)
   at org.alfresco.repo.web.scripts.RepositoryContainer.transactionedExecuteAs(RepositoryContainer.java:500)
   at org.alfresco.repo.web.scripts.RepositoryContainer.executeScript(RepositoryContainer.java:316)
   at org.springframework.extensions.webscripts.AbstractRuntime.executeScript(AbstractRuntime.java:372)
   at org.springframework.extensions.webscripts.AbstractRuntime.executeScript(AbstractRuntime.java:209)
   at org.springframework.extensions.webscripts.servlet.WebScriptServlet.service(WebScriptServlet.java:118)
   at javax.servlet.http.HttpServlet.service(HttpServlet.java:717)
   at org.apache.catalina.core.ApplicationFilterChain.internalDoFilter(ApplicationFilterChain.java:290)
   at org.apache.catalina.core.ApplicationFilterChain.doFilter(ApplicationFilterChain.java:206)
   at org.alfresco.web.app.servlet.GlobalLocalizationFilter.doFilter(GlobalLocalizationFilter.java:58)
   at org.apache.catalina.core.ApplicationFilterChain.internalDoFilter(ApplicationFilterChain.java:235)
   at org.apache.catalina.core.ApplicationFilterChain.doFilter(ApplicationFilterChain.java:206)
   at org.apache.catalina.core.StandardWrapperValve.invoke(StandardWrapperValve.java:233)
   at org.apache.catalina.core.StandardContextValve.invoke(StandardContextValve.java:191)
   at org.apache.catalina.authenticator.AuthenticatorBase.invoke(AuthenticatorBase.java:470)
   at org.apache.catalina.core.StandardHostValve.invoke(StandardHostValve.java:127)
   at org.apache.catalina.valves.ErrorReportValve.invoke(ErrorReportValve.java:102)
   at org.apache.catalina.core.StandardEngineValve.invoke(StandardEngineValve.java:109)
   at org.apache.catalina.connector.CoyoteAdapter.service(CoyoteAdapter.java:298)
   at org.apache.coyote.http11.Http11AprProcessor.process(Http11AprProcessor.java:861)
   at org.apache.coyote.http11.Http11AprProtocol$Http11ConnectionHandler.process(Http11AprProtocol.java:579)
   at org.apache.tomcat.util.net.AprEndpoint$Worker.run(AprEndpoint.java:1584)
   at java.lang.Thread.run(Thread.java:662)
Caused by: org.alfresco.scripts.ScriptException: 081028940 Failed to execute script 'classpath*:alfresco/templates/webscripts/org/alfresco/collaboration/tagQuery.get.js': 081028939 Failed to execute search: PATH:"/app:company_home//*" AND ASPECT:"{http://www.alfresco.org/model/content/1.0}taggable"
   at org.alfresco.repo.jscript.RhinoScriptProcessor.execute(RhinoScriptProcessor.java:195)
   at org.alfresco.repo.processor.ScriptServiceImpl.execute(ScriptServiceImpl.java:212)
   at org.alfresco.repo.processor.ScriptServiceImpl.executeScript(ScriptServiceImpl.java:174)
   at org.alfresco.repo.web.scripts.RepositoryScriptProcessor.executeScript(RepositoryScriptProcessor.java:102)
   at org.springframework.extensions.webscripts.AbstractWebScript.executeScript(AbstractWebScript.java:1194)
   at org.springframework.extensions.webscripts.DeclarativeWebScript.execute(DeclarativeWebScript.java:86)
   … 25 more
Caused by: org.alfresco.error.AlfrescoRuntimeException: 081028939 Failed to execute search: PATH:"/app:company_home//*" AND ASPECT:"{http://www.alfresco.org/model/content/1.0}taggable"
   at org.alfresco.repo.jscript.Search.query(Search.java:821)
   at org.alfresco.repo.jscript.Search.query(Search.java:779)
   at org.alfresco.repo.jscript.Search.query(Search.java:738)
   at org.alfresco.repo.jscript.Search.luceneSearch(Search.java:326)
   at org.alfresco.repo.jscript.Search.luceneSearch(Search.java:311)
   at sun.reflect.NativeMethodAccessorImpl.invoke0(Native Method)
   at sun.reflect.NativeMethodAccessorImpl.invoke(NativeMethodAccessorImpl.java:39)
   at sun.reflect.DelegatingMethodAccessorImpl.invoke(DelegatingMethodAccessorImpl.java:25)
   at java.lang.reflect.Method.invoke(Method.java:597)
   at org.mozilla.javascript.MemberBox.invoke(MemberBox.java:155)
   at org.mozilla.javascript.NativeJavaMethod.call(NativeJavaMethod.java:243)
   at org.mozilla.javascript.optimizer.OptRuntime.call1(OptRuntime.java:66)
   at org.mozilla.javascript.gen.c7._c1(file:/C:/Alfresco/tomcat/webapps/alfresco/WEB-INF/classes/alfresco/templates/webscripts/org/alfresco/collaboration/tagQuery.get.js:46)
   at org.mozilla.javascript.gen.c7.call(file:/C:/Alfresco/tomcat/webapps/alfresco/WEB-INF/classes/alfresco/templates/webscripts/org/alfresco/collaboration/tagQuery.get.js)
   at org.mozilla.javascript.optimizer.OptRuntime.callName0(OptRuntime.java:108)
   at org.mozilla.javascript.gen.c7._c0(file:/C:/Alfresco/tomcat/webapps/alfresco/WEB-INF/classes/alfresco/templates/webscripts/org/alfresco/collaboration/tagQuery.get.js:175)
   at org.mozilla.javascript.gen.c7.call(file:/C:/Alfresco/tomcat/webapps/alfresco/WEB-INF/classes/alfresco/templates/webscripts/org/alfresco/collaboration/tagQuery.get.js)
   at org.mozilla.javascript.ContextFactory.doTopCall(ContextFactory.java:393)
   at org.mozilla.javascript.ScriptRuntime.doTopCall(ScriptRuntime.java:2834)
   at org.mozilla.javascript.gen.c7.call(file:/C:/Alfresco/tomcat/webapps/alfresco/WEB-INF/classes/alfresco/templates/webscripts/org/alfresco/collaboration/tagQuery.get.js)
   at org.mozilla.javascript.gen.c7.exec(file:/C:/Alfresco/tomcat/webapps/alfresco/WEB-INF/classes/alfresco/templates/webscripts/org/alfresco/collaboration/tagQuery.get.js)
   at org.alfresco.repo.jscript.RhinoScriptProcessor.executeScriptImpl(RhinoScriptProcessor.java:483)
   at org.alfresco.repo.jscript.RhinoScriptProcessor.execute(RhinoScriptProcessor.java:191)
   … 30 more
Caused by: org.alfresco.repo.search.impl.lucene.LuceneQueryParserException: 081028938
   at org.alfresco.repo.search.impl.solr.SolrQueryHTTPClient.executeQuery(SolrQueryHTTPClient.java:364)
   at org.alfresco.repo.search.impl.solr.SolrQueryLanguage.executeQuery(SolrQueryLanguage.java:49)
   at org.alfresco.repo.search.impl.solr.SolrSearchService.query(SolrSearchService.java:348)
   at org.alfresco.repo.search.SearcherComponent.query(SearcherComponent.java:78)
   at sun.reflect.GeneratedMethodAccessor659.invoke(Unknown Source)
   at sun.reflect.DelegatingMethodAccessorImpl.invoke(DelegatingMethodAccessorImpl.java:25)
   at java.lang.reflect.Method.invoke(Method.java:597)
   at org.alfresco.repo.management.subsystems.SubsystemProxyFactory$1.invoke(SubsystemProxyFactory.java:65)
   at org.springframework.aop.framework.ReflectiveMethodInvocation.proceed(ReflectiveMethodInvocation.java:172)
   at org.springframework.aop.framework.JdkDynamicAopProxy.invoke(JdkDynamicAopProxy.java:202)
   at $Proxy13.query(Unknown Source)
   at sun.reflect.GeneratedMethodAccessor659.invoke(Unknown Source)
   at sun.reflect.DelegatingMethodAccessorImpl.invoke(DelegatingMethodAccessorImpl.java:25)
   at java.lang.reflect.Method.invoke(Method.java:597)
   at org.springframework.aop.support.AopUtils.invokeJoinpointUsingReflection(AopUtils.java:309)
   at org.springframework.aop.framework.ReflectiveMethodInvocation.invokeJoinpoint(ReflectiveMethodInvocation.java:183)
   at org.springframework.aop.framework.ReflectiveMethodInvocation.proceed(ReflectiveMethodInvocation.java:150)
   at net.sf.acegisecurity.intercept.method.aopalliance.MethodSecurityInterceptor.invoke(MethodSecurityInterceptor.java:80)
   at org.springframework.aop.framework.ReflectiveMethodInvocation.proceed(ReflectiveMethodInvocation.java:172)
   at org.alfresco.repo.security.permissions.impl.ExceptionTranslatorMethodInterceptor.invoke(ExceptionTranslatorMethodInterceptor.java:46)
   at org.springframework.aop.framework.ReflectiveMethodInvocation.proceed(ReflectiveMethodInvocation.java:172)
   at org.alfresco.repo.audit.AuditMethodInterceptor.invoke(AuditMethodInterceptor.java:147)
   at org.springframework.aop.framework.ReflectiveMethodInvocation.proceed(ReflectiveMethodInvocation.java:172)
   at org.springframework.transaction.interceptor.TransactionInterceptor.invoke(TransactionInterceptor.java:110)
   at org.springframework.aop.framework.ReflectiveMethodInvocation.proceed(ReflectiveMethodInvocation.java:172)
   at org.springframework.aop.framework.JdkDynamicAopProxy.invoke(JdkDynamicAopProxy.java:202)
   at $Proxy13.query(Unknown Source)
   at org.alfresco.repo.jscript.Search.query(Search.java:801)
   … 52 more
Caused by: javax.net.ssl.SSLHandshakeException: sun.security.validator.ValidatorException: PKIX path validation failed: java.security.cert.CertPathValidatorException: timestamp check failed
   at com.sun.net.ssl.internal.ssl.Alerts.getSSLException(Alerts.java:174)
   at com.sun.net.ssl.internal.ssl.SSLSocketImpl.fatal(SSLSocketImpl.java:1649)
   at com.sun.net.ssl.internal.ssl.Handshaker.fatalSE(Handshaker.java:241)
   at com.sun.net.ssl.internal.ssl.Handshaker.fatalSE(Handshaker.java:235)
   at com.sun.net.ssl.internal.ssl.ClientHandshaker.serverCertificate(ClientHandshaker.java:1206)
   at com.sun.net.ssl.internal.ssl.ClientHandshaker.processMessage(ClientHandshaker.java:136)
   at com.sun.net.ssl.internal.ssl.Handshaker.processLoop(Handshaker.java:593)
   at com.sun.net.ssl.internal.ssl.Handshaker.process_record(Handshaker.java:529)
   at com.sun.net.ssl.internal.ssl.SSLSocketImpl.readRecord(SSLSocketImpl.java:893)
   at com.sun.net.ssl.internal.ssl.SSLSocketImpl.performInitialHandshake(SSLSocketImpl.java:1138)
   at com.sun.net.ssl.internal.ssl.SSLSocketImpl.writeRecord(SSLSocketImpl.java:632)
   at com.sun.net.ssl.internal.ssl.AppOutputStream.write(AppOutputStream.java:59)
   at java.io.BufferedOutputStream.flushBuffer(BufferedOutputStream.java:65)
   at java.io.BufferedOutputStream.flush(BufferedOutputStream.java:123)
   at org.apache.commons.httpclient.methods.EntityEnclosingMethod.writeRequestBody(EntityEnclosingMethod.java:506)
   at org.apache.commons.httpclient.HttpMethodBase.writeRequest(HttpMethodBase.java:2114)
   at org.apache.commons.httpclient.HttpMethodBase.execute(HttpMethodBase.java:1096)
   at org.apache.commons.httpclient.HttpMethodDirector.executeWithRetry(HttpMethodDirector.java:398)
   at org.apache.commons.httpclient.HttpMethodDirector.executeMethod(HttpMethodDirector.java:171)
   at org.apache.commons.httpclient.HttpClient.executeMethod(HttpClient.java:397)
   at org.apache.commons.httpclient.HttpClient.executeMethod(HttpClient.java:323)
   at org.alfresco.repo.search.impl.solr.SolrQueryHTTPClient.executeQuery(SolrQueryHTTPClient.java:318)
   … 79 more
Caused by: sun.security.validator.ValidatorException: PKIX path validation failed: java.security.cert.CertPathValidatorException: timestamp check failed
   at sun.security.validator.PKIXValidator.doValidate(PKIXValidator.java:289)
   at sun.security.validator.PKIXValidator.doValidate(PKIXValidator.java:263)
   at sun.security.validator.PKIXValidator.engineValidate(PKIXValidator.java:173)
   at sun.security.validator.Validator.validate(Validator.java:218)
   at com.sun.net.ssl.internal.ssl.X509TrustManagerImpl.validate(X509TrustManagerImpl.java:126)
   at com.sun.net.ssl.internal.ssl.X509TrustManagerImpl.checkServerTrusted(X509TrustManagerImpl.java:209)
   at com.sun.net.ssl.internal.ssl.X509TrustManagerImpl.checkServerTrusted(X509TrustManagerImpl.java:249)
   at com.sun.net.ssl.internal.ssl.ClientHandshaker.serverCertificate(ClientHandshaker.java:1185)
   … 96 more
Caused by: java.security.cert.CertPathValidatorException: timestamp check failed
   at sun.security.provider.certpath.PKIXMasterCertPathValidator.validate(PKIXMasterCertPathValidator.java:139)
   at sun.security.provider.certpath.PKIXCertPathValidator.doValidate(PKIXCertPathValidator.java:328)
   at sun.security.provider.certpath.PKIXCertPathValidator.engineValidate(PKIXCertPathValidator.java:178)
   at java.security.cert.CertPathValidator.validate(CertPathValidator.java:250)
   at sun.security.validator.PKIXValidator.doValidate(PKIXValidator.java:275)
   … 103 more
Caused by: java.security.cert.CertificateExpiredException: NotAfter: Fri Aug 17 08:04:11 CLT 2012
   at sun.security.x509.CertificateValidity.valid(CertificateValidity.java:256)
   at sun.security.x509.X509CertImpl.checkValidity(X509CertImpl.java:570)
   at sun.security.provider.certpath.BasicChecker.verifyTimestamp(BasicChecker.java:157)
   at sun.security.provider.certpath.BasicChecker.check(BasicChecker.java:109)
   at sun.security.provider.certpath.PKIXMasterCertPathValidator.validate(PKIXMasterCertPathValidator.java:117)
   … 107 more
Highlighted
Member II

Re: Problemas con Etiquetas y busquedas en ALFRESCO 4.0.c

Hola,

Tambien me he dado cuenta de que las busquedas no funcionan en la version 4.0.d, simplemente no busca nada, he leido por ahi que es un bug de la versión, he instalado una 4.0.e y no hay este problema, ahor aquisiera migrar de mi 4.0.d a la 4.0.e, pero realemente no tengo idea de como hacerlo, mi instalación original la realice haciendo basicamente next, netxt en el wizard de instalación, el sistema operativo que uso es Windows Server 2008, no tenia nada instalado en mi maquina, asi que la base de datos se installó también por defecto en esa instalación, he leido que para migrar Alfresco basicamente se debe realizar una nueva instalación y apuntar en el alfresco-global.properties a la base de datos y el alf_data anterior, pero como mi base de datos se creo con la instalación de mi alfresco, no se como acceder a ella, podrian ayudarme porfavor, es algo urgente plis.

Saluditos
Highlighted
Intermediate

Re: Problemas con Etiquetas y busquedas en ALFRESCO 4.0.c

Va a ser este tu problema >> https://forums.alfresco.com/es/viewtopic.php?f=6&t=4313

Compruebalo  :wink:
Highlighted
Member II

Re: Problemas con Etiquetas y busquedas en ALFRESCO 4.0.c

Gracias por responder CristinaMR, el link que me proporcionaste me ha dado la pista, lo he solucionado simplemente cambiando a lucene, en el archivo de configuracion alfresco-global.properties he cambiado:

#index.subsystem.name=solr
por:
index.subsystem.name=lucene
index.recovery.mode=FULL

Las busquedas se realizan ahora sin problema.

Gracias